Reaction Details
TargetProtein kinase C eta type
LigandBDBM33971
Substrate/Competitorn/a
Meas. Tech.ChEMBL_1655173 (CHEMBL4004539)
IC50 6.1±n/a nM
Citation van Eis, MJEvenou, JSchuler, WZenke, GVangrevelinghe, EWagner, Jvon Matt, P Indolyl-naphthyl-maleimides as potent and selective inhibitors of protein kinase C-a/ß. Bioorg Med Chem Lett27:781-786 (2017) 
 
Protein kinase C eta type
Name:Protein kinase C eta type
Type:Enzyme
Mol. Mass.:77844.26
Organism:Homo sapiens (Human)
Description:The recombinant human PKC enzymes were produced using a baculovirus expression system in SF9 cells
Residue:683
BDBM33971
NameBDBM33971
Synonyms:AEB071 med.21724, Compound 190
TypeSmall organic molecule
Emp. Form.C25H22N6O2
Mol. Mass.438.4812
SMILESCN1CCN(CC1)c1nc(C2=C(C(=O)NC2=O)c2c[nH]c3ccccc23)c2ccccc2n1