Reaction Details
TargetProtein kinase C alpha type
LigandBDBM50235284
Substrate/Competitorn/a
Meas. Tech.ChEMBL_1655174 (CHEMBL4004540)
IC50 3.7±n/a nM
Citation van Eis, MJEvenou, JSchuler, WZenke, GVangrevelinghe, EWagner, Jvon Matt, P Indolyl-naphthyl-maleimides as potent and selective inhibitors of protein kinase C-a/ß. Bioorg Med Chem Lett27:781-786 (2017) 
 
Protein kinase C alpha type
Name:Protein kinase C alpha type
Type:Enzyme
Mol. Mass.:76755.65
Organism:Homo sapiens (Human)
Description:The recombinant human PKC enzymes were produced using a baculovirus expression system in SF9 cells
Residue:672
BDBM50235284
NameBDBM50235284
Synonyms:CHEMBL4064291
TypeSmall organic molecule
Emp. Form.C26H22ClN3O2
Mol. Mass.443.925
SMILESCN(C)Cc1ccc2c(C3=C(C(=O)NC3=O)c3cn(C)c4ccccc34)c(Cl)ccc2c1