Reaction Details
TargetProtein kinase C beta type
LigandBDBM50235282
Substrate/Competitorn/a
Meas. Tech.ChEMBL_1655188 (CHEMBL4004554)
Ki 0.500000±n/a nM
Citation van Eis, MJEvenou, JSchuler, WZenke, GVangrevelinghe, EWagner, Jvon Matt, P Indolyl-naphthyl-maleimides as potent and selective inhibitors of protein kinase C-a/ß. Bioorg Med Chem Lett27:781-786 (2017) 
 
Protein kinase C beta type
Name:Protein kinase C beta type
Type:Enzyme
Mol. Mass.:76873.67
Organism:Homo sapiens (Human)
Description:The recombinant human PKC enzymes were produced using a baculovirus expression system in SF9 cells
Residue:671
BDBM50235282
NameBDBM50235282
Synonyms:CHEMBL4077967
TypeSmall organic molecule
Emp. Form.C26H22ClN3O2
Mol. Mass.443.925
SMILESCN(C)Cc1ccc2ccc(Cl)c(C3=C(C(=O)NC3=O)c3cn(C)c4ccccc34)c2c1