Reaction Details
TargetHistone-lysine N-methyltransferase, H3 lysine-79 specific
LigandBDBM50235299
Substrate/Competitorn/a
Meas. Tech.ChEMBL_1655312 (CHEMBL4004678)
IC50 4.0±n/a nM
Citation Möbitz, HMachauer, RHolzer, PVaupel, AStauffer, FRagot, CCaravatti, GScheufler, CFernandez, CHommel, UTiedt, RBeyer, KSChen, CZhu, HGaul, C Discovery of Potent, Selective, and Structurally Novel Dot1L Inhibitors by a Fragment Linking Approach. ACS Med Chem Lett8:338-343 (2017) 
 
Histone-lysine N-methyltransferase, H3 lysine-79 specific
Name:Histone-lysine N-methyltransferase, H3 lysine-79 specific
Type:Protein
Mol. Mass.:184911.91
Organism:Homo sapiens (Human)
Description:Q8TEK3
Residue:1537
BDBM50235299
NameBDBM50235299
Synonyms:CHEMBL4066397
TypeSmall organic molecule
Emp. Form.C31H34ClN9O2
Mol. Mass.600.114
SMILESClc1ccccc1-n1ccc2ccc(NC(=O)NCC(=O)NCCCN[C@@H]3CCCN(C3)c3ncnc4[nH]ccc34)cc12