Reaction Details
TargetAcetylcholine receptor subunit alpha/beta/delta/epsilon
LigandBDBM50235306
Substrate/Competitorn/a
Meas. Tech.ChEMBL_1655336 (CHEMBL4004702)
EC50>100000±n/a nM
Citation King, DIwuagwu, CCook, JMcDonald, IMMate, RZusi, FCHill, MDFang, HZhao, RWang, BEaston, AEMiller, RPost-Munson, DKnox, RJGallagher, LWestphal, RMolski, TFan, JClarke, WBenitex, YLentz, KADenton, RMorgan, DZaczek, RLodge, NJBristow, LJMacor, JEOlson, RE BMS-933043, a Selectivea7 nAChR Partial Agonist for the Treatment of Cognitive Deficits Associated with Schizophrenia. ACS Med Chem Lett8:366-371 (2017) 
 
Acetylcholine receptor subunit alpha/beta/delta/epsilon
Name:Acetylcholine receptor subunit alpha/beta/delta/epsilon
Synonyms:Nicotinic acetylcholine receptor alpha-1/beta-1/delta/epsilon
Type:n/a
Mol. Mass.:n/a
Description:ASSAY_ID of ChEMBL is 1636037
Components:This complex has 4 components.
Component 1
Name:Acetylcholine receptor subunit beta
Type:PROTEIN
Mol. Mass.:57017.04
Organism:Rattus norvegicus
Description:ChEMBL_117053
Residue:501
Component 2
Name:Acetylcholine receptor subunit alpha
Synonyms:ACHA_RAT Acra Chrna1
Type:Enzyme Catalytic Domain
Mol. Mass.:51863.95
Organism:RAT
Description:Cholinergic, Nicotinic Alpha1Beta1DeltaGamma 0 RAT::P25108
Residue:457
Component 3
Name:Acetylcholine receptor subunit delta
Synonyms:ACHD_RAT Acrd | Chrnd
Type:PROTEIN
Mol. Mass.:58877.21
Organism:Rattus norvegicus
Description:ChEMBL_117053
Residue:517
Component 4
Name:Acetylcholine receptor subunit epsilon
Synonyms:ACHE_RAT Achre | Chrne
Type:PROTEIN
Mol. Mass.:54930.09
Organism:Rattus norvegicus
Description:ChEMBL_1292388
Residue:494
BDBM50235306
NameBDBM50235306
Synonyms:CHEMBL4084621
TypeSmall organic molecule
Emp. Form.C16H19N7O
Mol. Mass.325.3684
SMILESC1N=C(Nc2cc(ncn2)-n2ccnc2)O[C@]11CN2CCC1CC2