Reaction Details
TargetNeuronal acetylcholine receptor subunit alpha-7
LigandBDBM50206243
Substrate/Competitorn/a
Meas. Tech.ChEMBL_1655326 (CHEMBL4004692)
EC50 9.3±n/a nM
Citation King, DIwuagwu, CCook, JMcDonald, IMMate, RZusi, FCHill, MDFang, HZhao, RWang, BEaston, AEMiller, RPost-Munson, DKnox, RJGallagher, LWestphal, RMolski, TFan, JClarke, WBenitex, YLentz, KADenton, RMorgan, DZaczek, RLodge, NJBristow, LJMacor, JEOlson, RE BMS-933043, a Selectivea7 nAChR Partial Agonist for the Treatment of Cognitive Deficits Associated with Schizophrenia. ACS Med Chem Lett8:366-371 (2017) 
 
Neuronal acetylcholine receptor subunit alpha-7
Name:Neuronal acetylcholine receptor subunit alpha-7
Type:Enzyme
Mol. Mass.:56502.44
Organism:Rattus norvegicus (Rat)
Description:Q05941
Residue:502
BDBM50206243
NameBDBM50206243
Synonyms:CHEMBL3918431
TypeSmall organic molecule
Emp. Form.C18H20N4O
Mol. Mass.308.3776
SMILESC1N=C(Nc2cc3ccccc3cn2)O[C@]11CN2CCC1CC2