Reaction Details
TargetAcetylcholinesterase
LigandBDBM50235324
Substrate/Competitorn/a
Meas. Tech.ChEMBL_1655445 (CHEMBL4004915)
IC50 0.300000±n/a nM
Citation Sameem, BSaeedi, MMahdavi, MShafiee, A A review on tacrine-based scaffolds as multi-target drugs (MTDLs) for Alzheimer's disease. Eur J Med Chem128:332-345 (2017) 
 
Acetylcholinesterase
Name:Acetylcholinesterase
Type:Enzyme
Mol. Mass.:68193.62
Organism:Rattus norvegicus (rat)
Description:P37136
Residue:614
BDBM50235324
NameBDBM50235324
Synonyms:CHEMBL4104258
TypeSmall organic molecule
Emp. Form.C35H47ClN4
Mol. Mass.559.227
SMILESClc1ccc2c(NCCCCCCCCCNc3c4CCCCc4nc4CCCCc34)c3CCCCc3nc2c1