Reaction Details
TargetProstaglandin E2 receptor EP3 subtype
LigandBDBM50235370
Substrate/Competitorn/a
Meas. Tech.ChEMBL_1655814 (CHEMBL4005284)
Ki 210±n/a nM
Citation Tran, TAKramer, BShin, YJVallar, PBoatman, PDZou, NSage, CRGharbaoui, TKrishnan, APal, BShakya, SRGarrido Montalban, AAdams, JWRamirez, JBehan, DPShifrina, ABlackburn, ALeakakos, TShi, YMorgan, MSadeque, AChen, WUnett, DJGaidarov, IChen, XChang, SShu, HHTung, SFSemple, G Discovery of 2-(((1r,4r)-4-(((4-Chlorophenyl)(phenyl)carbamoyl)oxy)methyl)cyclohexyl)methoxy)acetate (Ralinepag): An Orally Active Prostacyclin Receptor Agonist for the Treatment of Pulmonary Arterial Hypertension. J Med Chem60:913-927 (2017) 
 
Prostaglandin E2 receptor EP3 subtype
Name:Prostaglandin E2 receptor EP3 subtype
Type:Enzyme
Mol. Mass.:43335.03
Organism:Homo sapiens (Human)
Description:P43115
Residue:390
BDBM50235370
NameBDBM50235370
Synonyms:CHEMBL3933704
TypeSmall organic molecule
Emp. Form.C23H26FNO5
Mol. Mass.415.4546
SMILESOC(=O)COC[C@H]1CC[C@H](COC(=O)N(c2ccccc2)c2cccc(F)c2)CC1