Reaction Details
TargetProstacyclin receptor
LigandBDBM50235374
Substrate/Competitorn/a
Meas. Tech.ChEMBL_1655797 (CHEMBL4005267)
IC50 39±n/a nM
Citation Tran, TAKramer, BShin, YJVallar, PBoatman, PDZou, NSage, CRGharbaoui, TKrishnan, APal, BShakya, SRGarrido Montalban, AAdams, JWRamirez, JBehan, DPShifrina, ABlackburn, ALeakakos, TShi, YMorgan, MSadeque, AChen, WUnett, DJGaidarov, IChen, XChang, SShu, HHTung, SFSemple, G Discovery of 2-(((1r,4r)-4-(((4-Chlorophenyl)(phenyl)carbamoyl)oxy)methyl)cyclohexyl)methoxy)acetate (Ralinepag): An Orally Active Prostacyclin Receptor Agonist for the Treatment of Pulmonary Arterial Hypertension. J Med Chem60:913-927 (2017) 
 
Prostacyclin receptor
Name:Prostacyclin receptor
Type:G Protein-Coupled Receptor (GPCR)
Mol. Mass.:40968.22
Organism:Homo sapiens (Human)
Description:The membranes prepared from human platelet were used in binding assay.
Residue:386
BDBM50235374
NameBDBM50235374
Synonyms:CHEMBL3935924
TypeSmall organic molecule
Emp. Form.C24H29NO5
Mol. Mass.411.4908
SMILESCc1ccc(cc1)N(C(=O)OC[C@H]1CC[C@H](COCC(O)=O)CC1)c1ccccc1