Reaction Details
TargetFarnesyl pyrophosphate synthase
LigandBDBM50235460
Substrate/Competitorn/a
Meas. Tech.ChEMBL_1657315 (CHEMBL4006785)
IC50 4800±n/a nM
Citation Park, JLeung, CYMatralis, ANLacbay, CMTsakos, MFernandez De Troconiz, GBerghuis, AMTsantrizos, YS Pharmacophore Mapping of Thienopyrimidine-Based Monophosphonate (ThP-MP) Inhibitors of the Human Farnesyl Pyrophosphate Synthase. J Med Chem60:2119-2134 (2017) 
 
Farnesyl pyrophosphate synthase
Name:Farnesyl pyrophosphate synthase
Type:Enzyme
Mol. Mass.:48272.89
Organism:Homo sapiens (Human)
Description:P14324
Residue:419
BDBM50235460
NameBDBM50235460
Synonyms:CHEMBL4068147
TypeSmall organic molecule
Emp. Form.C20H18N3O3PS
Mol. Mass.411.414
SMILESCc1ccc(cc1)-c1cc2c(NC(c3ccccc3)P(O)(O)=O)ncnc2s1