Reaction Details
TargetFarnesyl pyrophosphate synthase
LigandBDBM50235470
Substrate/Competitorn/a
Meas. Tech.ChEMBL_1657315 (CHEMBL4006785)
IC50 1100±n/a nM
Citation Park, JLeung, CYMatralis, ANLacbay, CMTsakos, MFernandez De Troconiz, GBerghuis, AMTsantrizos, YS Pharmacophore Mapping of Thienopyrimidine-Based Monophosphonate (ThP-MP) Inhibitors of the Human Farnesyl Pyrophosphate Synthase. J Med Chem60:2119-2134 (2017) 
 
Farnesyl pyrophosphate synthase
Name:Farnesyl pyrophosphate synthase
Type:Enzyme
Mol. Mass.:48272.89
Organism:Homo sapiens (Human)
Description:P14324
Residue:419
BDBM50235470
NameBDBM50235470
Synonyms:CHEMBL4090564
TypeSmall organic molecule
Emp. Form.C21H19FN3O3PS
Mol. Mass.443.431
SMILESCc1ccc(cc1)-c1cc2c(NC(Cc3cccc(F)c3)P(O)(O)=O)ncnc2s1