Reaction Details
TargetPolycomb protein EED
LigandBDBM50235626
Substrate/Competitorn/a
Meas. Tech.ChEMBL_1657640 (CHEMBL4007110)
IC50 8300±n/a nM
Citation Curtin, MLPliushchev, MALi, HQTorrent, MDietrich, JDJakob, CGZhu, HZhao, HWang, YJi, ZClark, RFSarris, KASelvaraju, SShaw, BAlgire, MAHe, YRichardson, PLSweis, RFSun, CChiang, GGMichaelides, MR SAR of amino pyrrolidines as potent and novel protein-protein interaction inhibitors of the PRC2 complex through EED binding. Bioorg Med Chem Lett27:1576-1583 (2017) 
 
Polycomb protein EED
Name:Polycomb protein EED
Type:Protein
Mol. Mass.:50201.68
Organism:Homo sapiens (Human)
Description:O75530
Residue:441
BDBM50235626
NameBDBM50235626
Synonyms:CHEMBL4075197
TypeSmall organic molecule
Emp. Form.C22H25BrFN3
Mol. Mass.430.356
SMILESCN(C)[C@H]1CN(Cc2c(F)cccc2Br)C[C@@H]1c1cn(C)c2ccccc12