Reaction Details
TargetPolycomb protein EED
LigandBDBM50235651
Substrate/Competitorn/a
Meas. Tech.ChEMBL_1657638 (CHEMBL4007108)
Ki 18±n/a nM
Citation Curtin, MLPliushchev, MALi, HQTorrent, MDietrich, JDJakob, CGZhu, HZhao, HWang, YJi, ZClark, RFSarris, KASelvaraju, SShaw, BAlgire, MAHe, YRichardson, PLSweis, RFSun, CChiang, GGMichaelides, MR SAR of amino pyrrolidines as potent and novel protein-protein interaction inhibitors of the PRC2 complex through EED binding. Bioorg Med Chem Lett27:1576-1583 (2017) 
 
Polycomb protein EED
Name:Polycomb protein EED
Type:Protein
Mol. Mass.:50201.68
Organism:Homo sapiens (Human)
Description:O75530
Residue:441
BDBM50235651
NameBDBM50235651
Synonyms:CHEMBL4089371
TypeSmall organic molecule
Emp. Form.C23H30FN3O
Mol. Mass.383.5022
SMILESCN(C)[C@H]1CN(Cc2c(C)cccc2F)C[C@@H]1c1ccc(cc1)C(=O)N(C)C