Reaction Details
TargetPolycomb protein EED
LigandBDBM50235632
Substrate/Competitorn/a
Meas. Tech.ChEMBL_1657639 (CHEMBL4007109)
IC50 31±n/a nM
Citation Curtin, MLPliushchev, MALi, HQTorrent, MDietrich, JDJakob, CGZhu, HZhao, HWang, YJi, ZClark, RFSarris, KASelvaraju, SShaw, BAlgire, MAHe, YRichardson, PLSweis, RFSun, CChiang, GGMichaelides, MR SAR of amino pyrrolidines as potent and novel protein-protein interaction inhibitors of the PRC2 complex through EED binding. Bioorg Med Chem Lett27:1576-1583 (2017) 
 
Polycomb protein EED
Name:Polycomb protein EED
Type:Protein
Mol. Mass.:50201.68
Organism:Homo sapiens (Human)
Description:O75530
Residue:441
BDBM50235632
NameBDBM50235632
Synonyms:CHEMBL4077363
TypeSmall organic molecule
Emp. Form.C27H32F2N4O
Mol. Mass.466.566
SMILESCN(C)[C@H]1CN(Cc2c(C)cccc2F)C[C@@H]1c1cn(C)c2c(cccc12)C(=O)N1CC(F)C1