Reaction Details
TargetPolycomb protein EED
LigandBDBM50235630
Substrate/Competitorn/a
Meas. Tech.ChEMBL_1657639 (CHEMBL4007109)
IC50 57±n/a nM
Citation Curtin, MLPliushchev, MALi, HQTorrent, MDietrich, JDJakob, CGZhu, HZhao, HWang, YJi, ZClark, RFSarris, KASelvaraju, SShaw, BAlgire, MAHe, YRichardson, PLSweis, RFSun, CChiang, GGMichaelides, MR SAR of amino pyrrolidines as potent and novel protein-protein interaction inhibitors of the PRC2 complex through EED binding. Bioorg Med Chem Lett27:1576-1583 (2017) 
 
Polycomb protein EED
Name:Polycomb protein EED
Type:Protein
Mol. Mass.:50201.68
Organism:Homo sapiens (Human)
Description:O75530
Residue:441
BDBM50235630
NameBDBM50235630
Synonyms:CHEMBL4093096
TypeSmall organic molecule
Emp. Form.C27H36FN3O2S
Mol. Mass.485.657
SMILESCN(C)[C@H]1CC(C[C@@H]1c1ccc(cc1)N1CCN(CC1)S(C)(=O)=O)C1CCc2cccc(F)c12