Reaction Details
TargetVitamin K epoxide reductase complex subunit 1
LigandBDBM50235670
Substrate/Competitorn/a
Meas. Tech.ChEMBL_1657647 (CHEMBL4007117)
Ki 30±n/a nM
Citation Montagut-Romans, ABoulven, MJacolot, MMoebs-Sanchez, SHascoët, CHammed, ABesse, SLemaire, MBenoit, ELattard, VPopowycz, F Synthesis and biological evaluation of C-3 aliphatic coumarins as vitamin K antagonists. Bioorg Med Chem Lett27:1598-1601 (2017) 
 
Vitamin K epoxide reductase complex subunit 1
Name:Vitamin K epoxide reductase complex subunit 1
Type:Enzyme
Mol. Mass.:17793.51
Organism:Rattus norvegicus (Rat)
Description:Q6TEK4
Residue:161
BDBM50235670
NameBDBM50235670
Synonyms:CHEMBL4079988
TypeSmall organic molecule
Emp. Form.C27H34O3
Mol. Mass.406.5571
SMILESCCCCCCCCCCCC(c1ccccc1)c1c(O)c2ccccc2oc1=O