Reaction Details
TargetHistone deacetylase 6
LigandBDBM50235707
Substrate/Competitorn/a
Meas. Tech.ChEMBL_1657747 (CHEMBL4007217)
Ki>50000±n/a nM
Citation Meyners, CWolff, BKleinschek, AKrämer, AMeyer-Almes, FJ Perfluorinated hydroxamic acids are potent and selective inhibitors of HDAC-like enzymes from Pseudomonas aeruginosa. Bioorg Med Chem Lett27:1508-1512 (2017) 
 
Histone deacetylase 6
Name:Histone deacetylase 6
Type:Chromatin regulator; hydrolase; repressor
Mol. Mass.:131381.51
Organism:Homo sapiens (Human)
Description:Q9UBN7
Residue:1215
BDBM50235707
NameBDBM50235707
Synonyms:CHEMBL4095542
TypeSmall organic molecule
Emp. Form.C15H10F12N2O4
Mol. Mass.510.2317
SMILESCOc1ccc(NC(=O)C(F)(F)C(F)(F)C(F)(F)C(F)(F)C(F)(F)C(F)(F)C(=O)NO)cc1