Reaction Details
TargetHistone deacetylase 5
LigandBDBM50235707
Substrate/Competitorn/a
Meas. Tech.ChEMBL_1657751 (CHEMBL4007221)
Ki>50000±n/a nM
Citation Meyners, CWolff, BKleinschek, AKrämer, AMeyer-Almes, FJ Perfluorinated hydroxamic acids are potent and selective inhibitors of HDAC-like enzymes from Pseudomonas aeruginosa. Bioorg Med Chem Lett27:1508-1512 (2017) 
 
Histone deacetylase 5
Name:Histone deacetylase 5
Type:Enzyme
Mol. Mass.:121968.61
Organism:Homo sapiens (Human)
Description:Q9UQL6
Residue:1122
BDBM50235707
NameBDBM50235707
Synonyms:CHEMBL4095542
TypeSmall organic molecule
Emp. Form.C15H10F12N2O4
Mol. Mass.510.2317
SMILESCOc1ccc(NC(=O)C(F)(F)C(F)(F)C(F)(F)C(F)(F)C(F)(F)C(F)(F)C(=O)NO)cc1