Reaction Details
TargetAcetylcholinesterase
LigandBDBM50235800
Substrate/Competitorn/a
Meas. Tech.ChEMBL_1657926 (CHEMBL4007538)
IC50>10000±n/a nM
Citation Wu, JTian, YWang, SPistolozzi, MJin, YZhou, TRoy, GXu, LTan, W Design, synthesis and biological evaluation of bambuterol analogues as novel inhibitors of butyrylcholinesterase. Eur J Med Chem126:61-71 (2017) 
 
Acetylcholinesterase
Name:Acetylcholinesterase
Type:Enzyme
Mol. Mass.:67792.70
Organism:Homo sapiens (Human)
Description:P22303
Residue:614
BDBM50235800
NameBDBM50235800
Synonyms:Bambuterol | CHEBI:553827
TypeSmall organic molecule
Emp. Form.C18H29N3O5
Mol. Mass.367.44
SMILESCN(C)C(=O)Oc1cc(OC(=O)N(C)C)cc(c1)C(O)CNC(C)(C)C