Reaction Details
TargetBeta-hexosaminidase subunit alpha
LigandBDBM50235813
Substrate/Competitorn/a
Meas. Tech.ChEMBL_1657985 (CHEMBL4007597)
IC50 100±n/a nM
Citation Front, SBiela-Banas, ABurda, PBallhausen, DHigaki, KCaciotti, AMorrone, ACharollais-Thoenig, JGallienne, EDemotz, SMartin, OR (5aR)-5a-C-Pentyl-4-epi-isofagomine: A powerful inhibitor of lysosomalß-galactosidase and a remarkable chaperone for mutations associated with GM1-gangliosidosis and Morquio disease type B. Eur J Med Chem126:160-170 (2017) 
 
Beta-hexosaminidase subunit alpha
Name:Beta-hexosaminidase subunit alpha
Type:Protein
Mol. Mass.:60688.46
Organism:Homo sapiens (Human)
Description:P06865
Residue:529
BDBM50235813
NameBDBM50235813
Synonyms:CHEMBL4097052
TypeSmall organic molecule
Emp. Form.C19H30N2O5
Mol. Mass.366.4519
SMILESCC(=O)N[C@H]1[C@@H](COCCCCc2ccccc2)N[C@H](CO)[C@@H](O)[C@@H]1O