Reaction Details
TargetLeukocyte tyrosine kinase receptor
LigandBDBM50235817
Substrate/Competitorn/a
Meas. Tech.ChEBML_1658109
IC50>10000±n/a nM
Citation Hoemann, MWilson, NArgiriadi, MBanach, DBurchat, ACalderwood, DClapham, BCox, PDuignan, DBKonopacki, DSomal, GVasudevan, A Synthesis and optimization of furano[3,2-d]pyrimidines as selective spleen tyrosine kinase (Syk) inhibitors. Bioorg Med Chem Lett26:5562-5567 (2016) 
 
Leukocyte tyrosine kinase receptor
Name:Leukocyte tyrosine kinase receptor
Type:PROTEIN
Mol. Mass.:91679.76
Organism:Homo sapiens (Human)
Description:ChEMBL_586334
Residue:864
BDBM50235817
NameBDBM50235817
Synonyms:CHEMBL4078893
TypeSmall organic molecule
Emp. Form.C18H17ClF3N5O2
Mol. Mass.427.808
SMILESFC(F)(F)CNc1nc(Nc2ccc(N3CCOCC3)c(Cl)c2)nc2ccoc12