Reaction Details
TargetSerine/threonine-protein kinase PAK 4
LigandBDBM50235816
Substrate/Competitorn/a
Meas. Tech.ChEMBL_1658119 (CHEMBL4007731)
IC50>10000±n/a nM
Citation Hoemann, MWilson, NArgiriadi, MBanach, DBurchat, ACalderwood, DClapham, BCox, PDuignan, DBKonopacki, DSomal, GVasudevan, A Synthesis and optimization of furano[3,2-d]pyrimidines as selective spleen tyrosine kinase (Syk) inhibitors. Bioorg Med Chem Lett26:5562-5567 (2016) 
 
Serine/threonine-protein kinase PAK 4
Name:Serine/threonine-protein kinase PAK 4
Type:Protein
Mol. Mass.:64098.01
Organism:Homo sapiens (Human)
Description:O96013
Residue:591
BDBM50235816
NameBDBM50235816
Synonyms:CHEMBL4069365
TypeSmall organic molecule
Emp. Form.C19H18F3N5O3
Mol. Mass.421.3731
SMILESCC1(C)OCC(=O)Nc2cc(Nc3nc(NCC(F)(F)F)c4occc4n3)ccc12