Reaction Details
TargetDual specificity mitogen-activated protein kinase kinase 2
LigandBDBM50235830
Substrate/Competitorn/a
Meas. Tech.ChEMBL_1658115 (CHEMBL4007727)
IC50 391±n/a nM
Citation Hoemann, MWilson, NArgiriadi, MBanach, DBurchat, ACalderwood, DClapham, BCox, PDuignan, DBKonopacki, DSomal, GVasudevan, A Synthesis and optimization of furano[3,2-d]pyrimidines as selective spleen tyrosine kinase (Syk) inhibitors. Bioorg Med Chem Lett26:5562-5567 (2016) 
 
Dual specificity mitogen-activated protein kinase kinase 2
Name:Dual specificity mitogen-activated protein kinase kinase 2
Type:Enzyme Catalytic Domain
Mol. Mass.:44423.61
Organism:Homo sapiens (Human)
Description:gi_13489054
Residue:400
BDBM50235830
NameBDBM50235830
Synonyms:CHEMBL2006765
TypeSmall organic molecule
Emp. Form.C18H19F3N6O
Mol. Mass.392.3783
SMILESCCCNC(=O)c1ccc(Nc2nc(NCC(F)(F)F)c3cc[nH]c3n2)cc1