Reaction Details
TargetFibroblast growth factor receptor 1
LigandBDBM50235820
Substrate/Competitorn/a
Meas. Tech.ChEMBL_1658094 (CHEMBL4007706)
IC50>10000±n/a nM
Citation Hoemann, MWilson, NArgiriadi, MBanach, DBurchat, ACalderwood, DClapham, BCox, PDuignan, DBKonopacki, DSomal, GVasudevan, A Synthesis and optimization of furano[3,2-d]pyrimidines as selective spleen tyrosine kinase (Syk) inhibitors. Bioorg Med Chem Lett26:5562-5567 (2016) 
 
Fibroblast growth factor receptor 1
Name:Fibroblast growth factor receptor 1
Type:Receptor
Mol. Mass.:91861.70
Organism:Homo sapiens (Human)
Description:P11362
Residue:822
BDBM50235820
NameBDBM50235820
Synonyms:CHEMBL4066664
TypeSmall organic molecule
Emp. Form.C15H11F3N6O
Mol. Mass.348.2826
SMILESFC(F)(F)CNc1nc(Nc2ccc3cn[nH]c3c2)nc2ccoc12