Reaction Details
TargetPlatelet-derived growth factor receptor alpha
LigandBDBM50235816
Substrate/Competitorn/a
Meas. Tech.ChEMBL_1658120 (CHEMBL4007732)
IC50 5590±n/a nM
Citation Hoemann, MWilson, NArgiriadi, MBanach, DBurchat, ACalderwood, DClapham, BCox, PDuignan, DBKonopacki, DSomal, GVasudevan, A Synthesis and optimization of furano[3,2-d]pyrimidines as selective spleen tyrosine kinase (Syk) inhibitors. Bioorg Med Chem Lett26:5562-5567 (2016) 
 
Platelet-derived growth factor receptor alpha
Name:Platelet-derived growth factor receptor alpha
Type:Protein
Mol. Mass.:122633.38
Organism:Homo sapiens (Human)
Description:P16234
Residue:1089
BDBM50235816
NameBDBM50235816
Synonyms:CHEMBL4069365
TypeSmall organic molecule
Emp. Form.C19H18F3N5O3
Mol. Mass.421.3731
SMILESCC1(C)OCC(=O)Nc2cc(Nc3nc(NCC(F)(F)F)c4occc4n3)ccc12