Reaction Details
TargetVascular endothelial growth factor receptor 1
LigandBDBM50235833
Substrate/Competitorn/a
Meas. Tech.ChEMBL_1658095 (CHEMBL4007707)
IC50>10000±n/a nM
Citation Hoemann, MWilson, NArgiriadi, MBanach, DBurchat, ACalderwood, DClapham, BCox, PDuignan, DBKonopacki, DSomal, GVasudevan, A Synthesis and optimization of furano[3,2-d]pyrimidines as selective spleen tyrosine kinase (Syk) inhibitors. Bioorg Med Chem Lett26:5562-5567 (2016) 
 
Vascular endothelial growth factor receptor 1
Name:Vascular endothelial growth factor receptor 1
Type:Receptor Tyrosine Kinase
Mol. Mass.:150800.23
Organism:Homo sapiens (Human)
Description:P17948
Residue:1338
BDBM50235833
NameBDBM50235833
Synonyms:CHEMBL4062803
TypeSmall organic molecule
Emp. Form.C17H16N6O
Mol. Mass.320.3485
SMILESCc1n[nH]c2cc(Nc3nc(NC4CC4)c4occc4n3)ccc12