Reaction Details
TargetCalcium/calmodulin-dependent protein kinase type II subunit alpha
LigandBDBM50235820
Substrate/Competitorn/a
Meas. Tech.ChEMBL_1658078 (CHEMBL4007690)
IC50>10000±n/a nM
Citation Hoemann, MWilson, NArgiriadi, MBanach, DBurchat, ACalderwood, DClapham, BCox, PDuignan, DBKonopacki, DSomal, GVasudevan, A Synthesis and optimization of furano[3,2-d]pyrimidines as selective spleen tyrosine kinase (Syk) inhibitors. Bioorg Med Chem Lett26:5562-5567 (2016) 
 
Calcium/calmodulin-dependent protein kinase type II subunit alpha
Name:Calcium/calmodulin-dependent protein kinase type II subunit alpha
Type:Enzyme Catalytic Domain
Mol. Mass.:54093.63
Organism:Homo sapiens (Human)
Description:gi_25952118
Residue:478
BDBM50235820
NameBDBM50235820
Synonyms:CHEMBL4066664
TypeSmall organic molecule
Emp. Form.C15H11F3N6O
Mol. Mass.348.2826
SMILESFC(F)(F)CNc1nc(Nc2ccc3cn[nH]c3c2)nc2ccoc12