Reaction Details
TargetLeukocyte tyrosine kinase receptor
LigandBDBM50235830
Substrate/Competitorn/a
Meas. Tech.ChEMBL_1658109 (CHEMBL4007721)
IC50 360±n/a nM
Citation Hoemann, MWilson, NArgiriadi, MBanach, DBurchat, ACalderwood, DClapham, BCox, PDuignan, DBKonopacki, DSomal, GVasudevan, A Synthesis and optimization of furano[3,2-d]pyrimidines as selective spleen tyrosine kinase (Syk) inhibitors. Bioorg Med Chem Lett26:5562-5567 (2016) 
 
Leukocyte tyrosine kinase receptor
Name:Leukocyte tyrosine kinase receptor
Type:PROTEIN
Mol. Mass.:91679.76
Organism:Homo sapiens (Human)
Description:ChEMBL_586334
Residue:864
BDBM50235830
NameBDBM50235830
Synonyms:CHEMBL2006765
TypeSmall organic molecule
Emp. Form.C18H19F3N6O
Mol. Mass.392.3783
SMILESCCCNC(=O)c1ccc(Nc2nc(NCC(F)(F)F)c3cc[nH]c3n2)cc1