Reaction Details
TargetFocal adhesion kinase 1
LigandBDBM50235820
Substrate/Competitorn/a
Meas. Tech.ChEMBL_1658093 (CHEMBL4007705)
IC50>10000±n/a nM
Citation Hoemann, MWilson, NArgiriadi, MBanach, DBurchat, ACalderwood, DClapham, BCox, PDuignan, DBKonopacki, DSomal, GVasudevan, A Synthesis and optimization of furano[3,2-d]pyrimidines as selective spleen tyrosine kinase (Syk) inhibitors. Bioorg Med Chem Lett26:5562-5567 (2016) 
 
Focal adhesion kinase 1
Name:Focal adhesion kinase 1
Type:Tyrosine-protein kinase
Mol. Mass.:119233.17
Organism:Homo sapiens (Human)
Description:Q05397
Residue:1052
BDBM50235820
NameBDBM50235820
Synonyms:CHEMBL4066664
TypeSmall organic molecule
Emp. Form.C15H11F3N6O
Mol. Mass.348.2826
SMILESFC(F)(F)CNc1nc(Nc2ccc3cn[nH]c3c2)nc2ccoc12