Reaction Details
TargetCasein kinase I isoform alpha
LigandBDBM50235830
Substrate/Competitorn/a
Meas. Tech.ChEMBL_1658085 (CHEMBL4007697)
IC50 872±n/a nM
Citation Hoemann, MWilson, NArgiriadi, MBanach, DBurchat, ACalderwood, DClapham, BCox, PDuignan, DBKonopacki, DSomal, GVasudevan, A Synthesis and optimization of furano[3,2-d]pyrimidines as selective spleen tyrosine kinase (Syk) inhibitors. Bioorg Med Chem Lett26:5562-5567 (2016) 
 
Casein kinase I isoform alpha
Name:Casein kinase I isoform alpha
Type:Serine/threonine-protein kinase
Mol. Mass.:38936.59
Organism:Homo sapiens (Human)
Description:P48729
Residue:337
BDBM50235830
NameBDBM50235830
Synonyms:CHEMBL2006765
TypeSmall organic molecule
Emp. Form.C18H19F3N6O
Mol. Mass.392.3783
SMILESCCCNC(=O)c1ccc(Nc2nc(NCC(F)(F)F)c3cc[nH]c3n2)cc1