Reaction Details
TargetTyrosine-protein kinase SYK
LigandBDBM50235834
Substrate/Competitorn/a
Meas. Tech.ChEMBL_1658035 (CHEMBL4007647)
IC50 63±n/a nM
Citation Hoemann, MWilson, NArgiriadi, MBanach, DBurchat, ACalderwood, DClapham, BCox, PDuignan, DBKonopacki, DSomal, GVasudevan, A Synthesis and optimization of furano[3,2-d]pyrimidines as selective spleen tyrosine kinase (Syk) inhibitors. Bioorg Med Chem Lett26:5562-5567 (2016) 
 
Tyrosine-protein kinase SYK
Name:Tyrosine-protein kinase SYK
Type:Enzyme
Mol. Mass.:72079.99
Organism:Homo sapiens (Human)
Description:P43405
Residue:635
BDBM50235834
NameBDBM50235834
Synonyms:CHEMBL4088907
TypeSmall organic molecule
Emp. Form.C17H14F3N5O2
Mol. Mass.377.3206
SMILESFC(F)(F)CNc1nc(Nc2ccc3CCC(=O)Nc3c2)nc2ccoc12