Reaction Details
TargetIndoleamine 2,3-dioxygenase 1
LigandBDBM50126144
Substrate/Competitorn/a
Meas. Tech.ChEMBL_1658250 (CHEMBL4007862)
IC50 60±n/a nM
Citation Tomek, PPalmer, BDFlanagan, JUSun, CRaven, ELChing, LM Discovery and evaluation of inhibitors to the immunosuppressive enzyme indoleamine 2,3-dioxygenase 1 (IDO1): Probing the active site-inhibitor interactions. Eur J Med Chem126:983-996 (2017) 
 
Indoleamine 2,3-dioxygenase 1
Name:Indoleamine 2,3-dioxygenase 1
Type:Enzyme
Mol. Mass.:45330.80
Organism:Homo sapiens (Human)
Description:P14902
Residue:403
BDBM50126144
NameBDBM50126144
Synonyms:CHEMBL3629569 US10233190, Example 1304
TypeSmall organic molecule
Emp. Form.C18H22N2O
Mol. Mass.282.3801
SMILESOC(CC1c2ccccc2-c2cncn12)C1CCCCC1