Reaction Details
TargetMineralocorticoid receptor
LigandBDBM50235935
Substrate/Competitorn/a
Meas. Tech.ChEMBL_1658428 (CHEMBL4008040)
Ki 0.330000±n/a nM
Citation Martín-Martínez, MPérez-Gordillo, FLÁlvarez de la Rosa, DRodríguez, YGerona-Navarro, GGonzález-Muñiz, RZhou, MM Modulating Mineralocorticoid Receptor with Non-steroidal Antagonists. New Opportunities for the Development of Potent and Selective Ligands without Off-Target Side Effects. J Med Chem60:2629-2650 (2017) 
 
Mineralocorticoid receptor
Name:Mineralocorticoid receptor
Type:Enzyme
Mol. Mass.:107076.42
Organism:Homo sapiens (Human)
Description:P08235
Residue:984
BDBM50235935
NameBDBM50235935
Synonyms:CHEMBL4088896
TypeSmall organic molecule
Emp. Form.C30H30FN5O3
Mol. Mass.527.5893
SMILESC[C@H](CN1CCOCC1)n1c2ccc(\C=C3/c4ccccc4COc4cc(F)ccc34)cc2[nH]c1=NC(N)=O