Reaction Details
TargetGlycogen synthase kinase-3 beta
LigandBDBM50140172
Substrate/Competitorn/a
Meas. Tech.ChEMBL_1658487 (CHEMBL4008099)
IC50 66±n/a nM
Citation Nelson, KMDahlin, JLBisson, JGraham, JPauli, GFWalters, MA The Essential Medicinal Chemistry of Curcumin. J Med Chem60:1620-1637 (2017) 
 
Glycogen synthase kinase-3 beta
Name:Glycogen synthase kinase-3 beta
Type:Enzyme
Mol. Mass.:46754.43
Organism:Rattus norvegicus (rat)
Description:The rat GSK-3 beta cDNA was inserted into the baculovirus vector. The protein was purified from virus-infected sf9 insect cells
Residue:420
BDBM50140172
NameBDBM50140172
Synonyms:CHEBI:3962 Curcumin | US9409845, Table 1, Compound 21: curcumin
TypeSmall organic molecule
Emp. Form.C21H20O6
Mol. Mass.368.3799
SMILESCOc1cc(\C=C\C(=O)CC(=O)\C=C\c2ccc(O)c(OC)c2)ccc1O