Reaction Details
TargetPeroxisome proliferator-activated receptor gamma
LigandBDBM24566
Substrate/Competitorn/a
Meas. Tech.ChEMBL_1658515 (CHEMBL4008127)
Kd 1297±n/a nM
Citation Piemontese, LCerchia, CLaghezza, AZiccardi, PSblano, STortorella, PIacobazzi, VInfantino, VConvertini, PDal Piaz, FLupo, AColantuoni, VLavecchia, ALoiodice, F New diphenylmethane derivatives as peroxisome proliferator-activated receptor alpha/gamma dual agonists endowed with anti-proliferative effects and mitochondrial activity. Eur J Med Chem127:379-397 (2017) 
 
Peroxisome proliferator-activated receptor gamma
Name:Peroxisome proliferator-activated receptor gamma
Type:Nuclear Receptor
Mol. Mass.:57613.46
Organism:Homo sapiens (Human)
Description:P37231
Residue:505
BDBM24566
NameBDBM24566
Synonyms:2-({4-chloro-6-[(2,3-dimethylphenyl)amino]pyrimidin-2-yl}sulfanyl)acetic acid JMC515449 Compound 1 Wyeth 14,643
TypeSmall organic molecule
Emp. Form.C14H14ClN3O2S
Mol. Mass.323.798
SMILESCc1cccc(Nc2cc(Cl)nc(SCC(O)=O)n2)c1C