Reaction Details
TargetPolycomb protein EED
LigandBDBM50235989
Substrate/Competitorn/a
Meas. Tech.ChEBML_1658555
IC50 62±n/a nM
Citation Huang, YZhang, JYu, ZZhang, HWang, YLingel, AQi, WGu, JZhao, KShultz, MDWang, LFu, XSun, YZhang, QJiang, XZhang, JZhang, CLi, LZeng, JFeng, LZhang, CLiu, YZhang, MZhang, LZhao, MGao, ZLiu, XFang, DGuo, HMi, YGabriel, TDillon, MPAtadja, POyang, C Discovery of First-in-Class, Potent, and Orally Bioavailable Embryonic Ectoderm Development (EED) Inhibitor with Robust Anticancer Efficacy. J Med Chem60:2215-2226 (2017) 
 
Polycomb protein EED
Name:Polycomb protein EED
Type:Protein
Mol. Mass.:50201.68
Organism:Homo sapiens (Human)
Description:O75530
Residue:441
BDBM50235989
NameBDBM50235989
Synonyms:CHEMBL4067448
TypeSmall organic molecule
Emp. Form.C18H13N5O
Mol. Mass.315.3287
SMILESN#Cc1cc(-c2ccccc2)c2nncn2c1NCc1ccco1