Reaction Details
TargetPolycomb protein EED
LigandBDBM50235992
Substrate/Competitorn/a
Meas. Tech.ChEMBL_1658555 (CHEMBL4008167)
IC50 210±n/a nM
Citation Huang, YZhang, JYu, ZZhang, HWang, YLingel, AQi, WGu, JZhao, KShultz, MDWang, LFu, XSun, YZhang, QJiang, XZhang, JZhang, CLi, LZeng, JFeng, LZhang, CLiu, YZhang, MZhang, LZhao, MGao, ZLiu, XFang, DGuo, HMi, YGabriel, TDillon, MPAtadja, POyang, C Discovery of First-in-Class, Potent, and Orally Bioavailable Embryonic Ectoderm Development (EED) Inhibitor with Robust Anticancer Efficacy. J Med Chem60:2215-2226 (2017) 
 
Polycomb protein EED
Name:Polycomb protein EED
Type:Protein
Mol. Mass.:50201.68
Organism:Homo sapiens (Human)
Description:O75530
Residue:441
BDBM50235992
NameBDBM50235992
Synonyms:CHEMBL4093147
TypeSmall organic molecule
Emp. Form.C18H12FN5O
Mol. Mass.333.3192
SMILESFc1ccccc1-c1cc(C#N)c(NCc2ccco2)n2cnnc12