Reaction Details
TargetPolycomb protein EED
LigandBDBM50236001
Substrate/Competitorn/a
Meas. Tech.ChEBML_1658555
IC50 770±n/a nM
Citation Huang, YZhang, JYu, ZZhang, HWang, YLingel, AQi, WGu, JZhao, KShultz, MDWang, LFu, XSun, YZhang, QJiang, XZhang, JZhang, CLi, LZeng, JFeng, LZhang, CLiu, YZhang, MZhang, LZhao, MGao, ZLiu, XFang, DGuo, HMi, YGabriel, TDillon, MPAtadja, POyang, C Discovery of First-in-Class, Potent, and Orally Bioavailable Embryonic Ectoderm Development (EED) Inhibitor with Robust Anticancer Efficacy. J Med Chem60:2215-2226 (2017) 
 
Polycomb protein EED
Name:Polycomb protein EED
Type:Protein
Mol. Mass.:50201.68
Organism:Homo sapiens (Human)
Description:O75530
Residue:441
BDBM50236001
NameBDBM50236001
Synonyms:CHEMBL4078858
TypeSmall organic molecule
Emp. Form.C18H19N7O
Mol. Mass.349.3898
SMILESCN(C)Cc1ccc(cc1)-c1cnc(NCc2ccon2)n2cnnc12