Reaction Details
TargetPolycomb protein EED
LigandBDBM50236014
Substrate/Competitorn/a
Meas. Tech.ChEMBL_1658554 (CHEMBL4008166)
IC50 14080±n/a nM
Citation Huang, YZhang, JYu, ZZhang, HWang, YLingel, AQi, WGu, JZhao, KShultz, MDWang, LFu, XSun, YZhang, QJiang, XZhang, JZhang, CLi, LZeng, JFeng, LZhang, CLiu, YZhang, MZhang, LZhao, MGao, ZLiu, XFang, DGuo, HMi, YGabriel, TDillon, MPAtadja, POyang, C Discovery of First-in-Class, Potent, and Orally Bioavailable Embryonic Ectoderm Development (EED) Inhibitor with Robust Anticancer Efficacy. J Med Chem60:2215-2226 (2017) 
 
Polycomb protein EED
Name:Polycomb protein EED
Type:Protein
Mol. Mass.:50201.68
Organism:Homo sapiens (Human)
Description:O75530
Residue:441
BDBM50236014
NameBDBM50236014
Synonyms:CHEMBL4097339
TypeSmall organic molecule
Emp. Form.C18H15N3O
Mol. Mass.289.3312
SMILESC(Nc1ccc(-c2ccccc2)c2cncn12)c1ccco1