Reaction Details
TargetPolycomb protein EED
LigandBDBM50236010
Substrate/Competitorn/a
Meas. Tech.ChEMBL_1658555 (CHEMBL4008167)
IC50 32±n/a nM
Citation Huang, YZhang, JYu, ZZhang, HWang, YLingel, AQi, WGu, JZhao, KShultz, MDWang, LFu, XSun, YZhang, QJiang, XZhang, JZhang, CLi, LZeng, JFeng, LZhang, CLiu, YZhang, MZhang, LZhao, MGao, ZLiu, XFang, DGuo, HMi, YGabriel, TDillon, MPAtadja, POyang, C Discovery of First-in-Class, Potent, and Orally Bioavailable Embryonic Ectoderm Development (EED) Inhibitor with Robust Anticancer Efficacy. J Med Chem60:2215-2226 (2017) 
 
Polycomb protein EED
Name:Polycomb protein EED
Type:Protein
Mol. Mass.:50201.68
Organism:Homo sapiens (Human)
Description:O75530
Residue:441
BDBM50236010
NameBDBM50236010
Synonyms:CHEMBL4103319
TypeSmall organic molecule
Emp. Form.C21H22N6O
Mol. Mass.374.439
SMILESC(Nc1ncc(-c2ccc(CN3CCCC3)cc2)c2nncn12)c1ccco1