Reaction Details
TargetPolycomb protein EED
LigandBDBM50236013
Substrate/Competitorn/a
Meas. Tech.ChEMBL_1658554 (CHEMBL4008166)
IC50 13±n/a nM
Citation Huang, YZhang, JYu, ZZhang, HWang, YLingel, AQi, WGu, JZhao, KShultz, MDWang, LFu, XSun, YZhang, QJiang, XZhang, JZhang, CLi, LZeng, JFeng, LZhang, CLiu, YZhang, MZhang, LZhao, MGao, ZLiu, XFang, DGuo, HMi, YGabriel, TDillon, MPAtadja, POyang, C Discovery of First-in-Class, Potent, and Orally Bioavailable Embryonic Ectoderm Development (EED) Inhibitor with Robust Anticancer Efficacy. J Med Chem60:2215-2226 (2017) 
 
Polycomb protein EED
Name:Polycomb protein EED
Type:Protein
Mol. Mass.:50201.68
Organism:Homo sapiens (Human)
Description:O75530
Residue:441
BDBM50236013
NameBDBM50236013
Synonyms:CHEMBL4081748
TypeSmall organic molecule
Emp. Form.C19H20N6O
Mol. Mass.348.4017
SMILESCN(C)Cc1ccc(cc1)-c1cnc(NCc2ccco2)n2cnnc12