Reaction Details
TargetDNA-directed RNA polymerase, mitochondrial
LigandBDBM50236025
Substrate/Competitorn/a
Meas. Tech.ChEMBL_1658646 (CHEMBL4008258)
IC50>200000±n/a nM
Citation Siegel, DHui, HCDoerffler, EClarke, MOChun, KZhang, LNeville, SCarra, ELew, WRoss, BWang, QWolfe, LJordan, RSoloveva, VKnox, JPerry, JPerron, MStray, KMBarauskas, OFeng, JYXu, YLee, GRheingold, ALRay, ASBannister, RStrickley, RSwaminathan, SLee, WABavari, SCihlar, TLo, MKWarren, TKMackman, RL Discovery and Synthesis of a Phosphoramidate Prodrug of a Pyrrolo[2,1-f][triazin-4-amino] Adenine C-Nucleoside (GS-5734) for the Treatment of Ebola and Emerging Viruses. J Med Chem60:1648-1661 (2017) 
 
DNA-directed RNA polymerase, mitochondrial
Name:DNA-directed RNA polymerase, mitochondrial
Type:PROTEIN
Mol. Mass.:138671.72
Organism:Homo sapiens (Human)
Description:ChEMBL_108039
Residue:1230
BDBM50236025
NameBDBM50236025
Synonyms:CHEMBL2016761 | US11149049, No. C2
TypeSmall organic molecule
Emp. Form.C12H16N5O13P3
Mol. Mass.531.2024
SMILESNc1ncnn2c(ccc12)[C@@]1(O[C@H](COP(O)(=O)OP(O)(=O)OP(O)(O)=O)[C@@H](O)[C@H]1O)C#N