Reaction Details
TargetCytoplasmic tyrosine-protein kinase BMX
LigandBDBM50236031
Substrate/Competitorn/a
Meas. Tech.ChEBML_1658703
IC50 133±n/a nM
Citation Liang, XLv, FWang, BYu, KWu, HQi, ZJiang, ZChen, CWang, AMiao, WWang, WHu, ZLiu, JLiu, XZhao, ZWang, LZhang, SYe, ZWang, CRen, TWang, YLiu, QLiu, J Discovery of 2-((3-Acrylamido-4-methylphenyl)amino)-N-(2-methyl-5-(3,4,5-trimethoxybenzamido)phenyl)-4-(methylamino)pyrimidine-5-carboxamide (CHMFL-BMX-078) as a Highly Potent and Selective Type II Irreversible Bone Marrow Kinase in the X Chromosome (BMX) Kinase Inhibitor. J Med Chem60:1793-1816 (2017) 
 
Cytoplasmic tyrosine-protein kinase BMX
Name:Cytoplasmic tyrosine-protein kinase BMX
Type:Tyrosine-protein kinase
Mol. Mass.:78030.42
Organism:Homo sapiens (Human)
Description:P51813
Residue:675
BDBM50236031
NameBDBM50236031
Synonyms:CHEMBL4074708
TypeSmall organic molecule
Emp. Form.C31H30FN7O3
Mol. Mass.567.6134
SMILESCNc1nc(Nc2ccc(C)c(NC(=O)C=C)c2)ncc1C(=O)Nc1cc(NC(=O)c2cc(C)ccc2F)ccc1C