Reaction Details
TargetCytoplasmic tyrosine-protein kinase BMX
LigandBDBM50323777
Substrate/Competitorn/a
Meas. Tech.ChEMBL_1658703 (CHEMBL4008315)
IC50 8±n/a nM
Citation Liang, XLv, FWang, BYu, KWu, HQi, ZJiang, ZChen, CWang, AMiao, WWang, WHu, ZLiu, JLiu, XZhao, ZWang, LZhang, SYe, ZWang, CRen, TWang, YLiu, QLiu, J Discovery of 2-((3-Acrylamido-4-methylphenyl)amino)-N-(2-methyl-5-(3,4,5-trimethoxybenzamido)phenyl)-4-(methylamino)pyrimidine-5-carboxamide (CHMFL-BMX-078) as a Highly Potent and Selective Type II Irreversible Bone Marrow Kinase in the X Chromosome (BMX) Kinase Inhibitor. J Med Chem60:1793-1816 (2017) 
 
Cytoplasmic tyrosine-protein kinase BMX
Name:Cytoplasmic tyrosine-protein kinase BMX
Type:Tyrosine-protein kinase
Mol. Mass.:78030.42
Organism:Homo sapiens (Human)
Description:P51813
Residue:675
BDBM50323777
NameBDBM50323777
Synonyms:CHEMBL1214141 | N-(4-Methyl-3-(1-methyl-7-(6-methylpyridin-3-ylamino)-2-oxo-1,2-dihydropyrimido[4,5-d]pyrimidin-3(4H)-yl)phenyl)-3-(trifluoromethyl)benzamide
TypeSmall organic molecule
Emp. Form.C28H24F3N7O2
Mol. Mass.547.5311
SMILESCN1C(=O)N(Cc2cnc(Nc3ccc(C)nc3)nc12)c1cc(NC(=O)c2cccc(c2)C(F)(F)F)ccc1C