Reaction Details
TargetCytoplasmic tyrosine-protein kinase BMX
LigandBDBM50236073
Substrate/Competitorn/a
Meas. Tech.ChEMBL_1658703 (CHEMBL4008315)
IC50 120±n/a nM
Citation Liang, XLv, FWang, BYu, KWu, HQi, ZJiang, ZChen, CWang, AMiao, WWang, WHu, ZLiu, JLiu, XZhao, ZWang, LZhang, SYe, ZWang, CRen, TWang, YLiu, QLiu, J Discovery of 2-((3-Acrylamido-4-methylphenyl)amino)-N-(2-methyl-5-(3,4,5-trimethoxybenzamido)phenyl)-4-(methylamino)pyrimidine-5-carboxamide (CHMFL-BMX-078) as a Highly Potent and Selective Type II Irreversible Bone Marrow Kinase in the X Chromosome (BMX) Kinase Inhibitor. J Med Chem60:1793-1816 (2017) 
 
Cytoplasmic tyrosine-protein kinase BMX
Name:Cytoplasmic tyrosine-protein kinase BMX
Type:Tyrosine-protein kinase
Mol. Mass.:78030.42
Organism:Homo sapiens (Human)
Description:P51813
Residue:675
BDBM50236073
NameBDBM50236073
Synonyms:CHEMBL4090174
TypeSmall organic molecule
Emp. Form.C32H30FN7O3
Mol. Mass.579.6241
SMILESCN1C(=O)N(Cc2cnc(Nc3ccc(C)c(NC(=O)C=C)c3)nc12)c1cc(NC(=O)c2cc(C)ccc2F)ccc1C