Reaction Details
TargetCytoplasmic tyrosine-protein kinase BMX
LigandBDBM50236044
Substrate/Competitorn/a
Meas. Tech.ChEMBL_1658703 (CHEMBL4008315)
IC50 11±n/a nM
Citation Liang, XLv, FWang, BYu, KWu, HQi, ZJiang, ZChen, CWang, AMiao, WWang, WHu, ZLiu, JLiu, XZhao, ZWang, LZhang, SYe, ZWang, CRen, TWang, YLiu, QLiu, J Discovery of 2-((3-Acrylamido-4-methylphenyl)amino)-N-(2-methyl-5-(3,4,5-trimethoxybenzamido)phenyl)-4-(methylamino)pyrimidine-5-carboxamide (CHMFL-BMX-078) as a Highly Potent and Selective Type II Irreversible Bone Marrow Kinase in the X Chromosome (BMX) Kinase Inhibitor. J Med Chem60:1793-1816 (2017) 
 
Cytoplasmic tyrosine-protein kinase BMX
Name:Cytoplasmic tyrosine-protein kinase BMX
Type:Tyrosine-protein kinase
Mol. Mass.:78030.42
Organism:Homo sapiens (Human)
Description:P51813
Residue:675
BDBM50236044
NameBDBM50236044
Synonyms:CHEMBL4066104
TypeSmall organic molecule
Emp. Form.C33H35N7O6
Mol. Mass.625.6743
SMILESCNc1nc(Nc2ccc(C)c(NC(=O)C=C)c2)ncc1C(=O)Nc1cc(NC(=O)c2cc(OC)c(OC)c(OC)c2)ccc1C