Reaction Details
TargetdCTP pyrophosphatase 1
LigandBDBM50236094
Substrate/Competitorn/a
Meas. Tech.ChEBML_1658761
IC50 204±n/a nM
Citation Llona-Minguez, SHöglund, AWiita, EAlmlöf, IMateus, ACalderón-Montaño, JMCazares-Körner, CHoman, ELoseva, OBaranczewski, PJemth, ASHäggblad, MMartens, ULundgren, BArtursson, PLundbäck, TJenmalm Jensen, AWarpman Berglund, UScobie, MHelleday, T Identification of Triazolothiadiazoles as Potent Inhibitors of the dCTP Pyrophosphatase 1. J Med Chem60:2148-2154 (2017) 
 
dCTP pyrophosphatase 1
Name:dCTP pyrophosphatase 1
Type:Protein
Mol. Mass.:18673.58
Organism:Homo sapiens (Human)
Description:Q9H773
Residue:170
BDBM50236094
NameBDBM50236094
Synonyms:CHEMBL4102676
TypeSmall organic molecule
Emp. Form.C18H11N5S
Mol. Mass.329.378
SMILESc1ccc(nc1)-c1nnc2sc(nn12)-c1cccc2ccccc12