Reaction Details
TargetdCTP pyrophosphatase 1
LigandBDBM50236102
Substrate/Competitorn/a
Meas. Tech.ChEBML_1658761
IC50 190±n/a nM
Citation Llona-Minguez, SHöglund, AWiita, EAlmlöf, IMateus, ACalderón-Montaño, JMCazares-Körner, CHoman, ELoseva, OBaranczewski, PJemth, ASHäggblad, MMartens, ULundgren, BArtursson, PLundbäck, TJenmalm Jensen, AWarpman Berglund, UScobie, MHelleday, T Identification of Triazolothiadiazoles as Potent Inhibitors of the dCTP Pyrophosphatase 1. J Med Chem60:2148-2154 (2017) 
 
dCTP pyrophosphatase 1
Name:dCTP pyrophosphatase 1
Type:Protein
Mol. Mass.:18673.58
Organism:Homo sapiens (Human)
Description:Q9H773
Residue:170
BDBM50236102
NameBDBM50236102
Synonyms:CHEMBL4095068
TypeSmall organic molecule
Emp. Form.C15H9N5O2S
Mol. Mass.323.329
SMILESC1Oc2ccc(cc2O1)-c1nn2c(nnc2s1)-c1ccccn1