Reaction Details
TargetdCTP pyrophosphatase 1
LigandBDBM50236124
Substrate/Competitorn/a
Meas. Tech.ChEBML_1658761
IC50 170±n/a nM
Citation Llona-Minguez, SHöglund, AWiita, EAlmlöf, IMateus, ACalderón-Montaño, JMCazares-Körner, CHoman, ELoseva, OBaranczewski, PJemth, ASHäggblad, MMartens, ULundgren, BArtursson, PLundbäck, TJenmalm Jensen, AWarpman Berglund, UScobie, MHelleday, T Identification of Triazolothiadiazoles as Potent Inhibitors of the dCTP Pyrophosphatase 1. J Med Chem60:2148-2154 (2017) 
 
dCTP pyrophosphatase 1
Name:dCTP pyrophosphatase 1
Type:Protein
Mol. Mass.:18673.58
Organism:Homo sapiens (Human)
Description:Q9H773
Residue:170
BDBM50236124
NameBDBM50236124
Synonyms:CHEMBL4086506
TypeSmall organic molecule
Emp. Form.C11H6N6S2
Mol. Mass.286.336
SMILESc1csc(c1)-c1nnc2sc(nn12)-c1cnccn1