Reaction Details
TargetLethal factor
LigandBDBM50236202
Substrate/Competitorn/a
Meas. Tech.ChEMBL_1658817 (CHEMBL4008429)
Ki 18±n/a nM
Citation Li, YGould, AAboye, TBi, TBreindel, LShekhtman, ACamarero, JA Full Sequence Amino Acid Scanning of¿-Defensin RTD-1 Yields a Potent Anthrax Lethal Factor Protease Inhibitor. J Med Chem60:1916-1927 (2017) 
 
Lethal factor
Name:Lethal factor
Type:PROTEIN
Mol. Mass.:93758.56
Organism:Bacillus anthracis
Description:ChEMBL_1460338
Residue:809
BDBM50236202
NameBDBM50236202
Synonyms:CHEMBL4074171
TypeSmall organic molecule
Emp. Form.C110H160N46O18S6
Mol. Mass.2607.135
SMILESNC(=N)NCCC[C@@H]1NC(=O)[C@H](CCCNC(N)=N)NC(=O)[C@@H]2CSSC[C@H](NC(=O)[C@H](Cc3c[nH]c4ccccc34)NC(=O)[C@H](CCCNC(N)=N)NC1=O)C(=O)N[C@@H](CCCNC(N)=N)C(=O)N[C@H]1CSSC[C@H](NC(=O)[C@H](CCCNC(N)=N)NC(=O)[C@@H]3CSSC[C@H](NC(=O)[C@H](Cc4c[nH]c5ccccc45)NC1=O)C(=O)N[C@@H](CCCNC(N)=N)C(=O)N[C@@H](CCCNC(N)=N)C(=O)N[C@@H](CCCNC(N)=N)C(=O)N[C@@H](Cc1c[nH]c4ccccc14)C(=O)N3)C(=O)N[C@@H](Cc1c[nH]c3ccccc13)C(=O)N2